Archives
Trending
Support
Login
clear text
XML
Django
JavaScript
MATLAB
C
C++
C#
Python
SQL
Shell
Bash
Markdown
YAML
JSON
HTML
CSS
PHP
Java
Ruby
Go
Rust
Swift
Kotlin
Arduino
TypeScript
Perl
Autohotkey
Lua
SQF
R
Scala
Haskell
Groovy
Dart
Clojure
VB.NET
Objective-C
PowerShell
Bash
CoffeeScript
Verilog
====================================================================== ERROR: test_idna (test.test_socket.GeneralModuleTests) ---------------------------------------------------------------------- Traceback (most recent call last): File "/home/h/Downloads/Python-3.4.2/Lib/test/test_socket.py", line 1287, in test_idna socket.gethostbyname('испытание.python.org') socket.gaierror: [Errno -5] No address associated with hostname ---------------------------------------------------------------------- Ran 506 tests in 150.098s FAILED (errors=1, skipped=24) test test_socket failed make: *** [test] Error 1
Mark as private (unlisted)
for 30 minutes
for 6 hours
for 1 day
for 1 week
for 1 month
for 1 year
everlasting (like CCCP)