====================================================================== ERROR: test_idna (test.test_socket.GeneralModuleTests) ---------------------------------------------------------------------- Traceback (most recent call last): File "/home/h/Downloads/Python-3.4.2/Lib/test/test_socket.py", line 1287, in test_idna socket.gethostbyname('испытание.python.org') socket.gaierror: [Errno -5] No address associated with hostname ---------------------------------------------------------------------- Ran 506 tests in 150.098s FAILED (errors=1, skipped=24) test test_socket failed make: *** [test] Error 1